Reaction Details
TargetD(2) dopamine receptor
LigandBDBM50169846
Substrate/Competitorn/a
Meas. Tech.ChEMBL_302285 (CHEMBL830303)
Ki>1500±n/a nM
Citation Fish, LRGilligan, MTHumphries, ACIvarsson, MLadduwahetty, TMerchant, KJO'Connor, DPatel, SPhilipps, EVargas, HMHutson, PHMacLeod, AM 4-Fluorosulfonylpiperidines: selective 5-HT2A ligands for the treatment of insomnia. Bioorg Med Chem Lett15:3665-9 (2005) 
 
D(2) dopamine receptor
Name:D(2) dopamine receptor
Type:Cell-surface receptors
Mol. Mass.:50647.10
Organism:Homo sapiens (Human)
Description:P14416
Residue:443
BDBM50169846
NameBDBM50169846
Synonyms:2-(4-Benzenesulfonyl-piperidin-1-yl)-1-(2,4-difluoro-phenyl)-ethanone | CHEMBL177807
TypeSmall organic molecule
Emp. Form.C19H19F2NO3S
Mol. Mass.379.421
SMILESFc1ccc(C(=O)CN2CCC(CC2)S(=O)(=O)c2ccccc2)c(F)c1