Reaction Details
Target5-hydroxytryptamine receptor 2A
LigandBDBM50169845
Substrate/Competitorn/a
Meas. Tech.ChEMBL_302343 (CHEMBL828927)
Ki 1.6±n/a nM
Citation Fish, LRGilligan, MTHumphries, ACIvarsson, MLadduwahetty, TMerchant, KJO'Connor, DPatel, SPhilipps, EVargas, HMHutson, PHMacLeod, AM 4-Fluorosulfonylpiperidines: selective 5-HT2A ligands for the treatment of insomnia. Bioorg Med Chem Lett15:3665-9 (2005) 
 
5-hydroxytryptamine receptor 2A
Name:5-hydroxytryptamine receptor 2A
Type:G Protein-Coupled Receptor (GPCR)
Mol. Mass.:52852.05
Organism:Rattus norvegicus (rat)
Description:Rat cortex membranes 5-HT2A receptors.
Residue:471
BDBM50169845
NameBDBM50169845
Synonyms:1-[2-(2,4-Difluoro-phenyl)-ethyl]-4-fluoro-4-(4-pyrazol-1-yl-benzenesulfonyl)-piperidine | CHEMBL178055
TypeSmall organic molecule
Emp. Form.C22H22F3N3O2S
Mol. Mass.449.489
SMILESFc1ccc(CCN2CCC(F)(CC2)S(=O)(=O)c2ccc(cc2)-n2cccn2)c(F)c1