Reaction Details
Target5-hydroxytryptamine receptor 2C
LigandBDBM50108690
Substrate/Competitorn/a
Meas. Tech.ChEMBL_302364 (CHEMBL828083)
Ki 25±n/a nM
Citation Fish, LRGilligan, MTHumphries, ACIvarsson, MLadduwahetty, TMerchant, KJO'Connor, DPatel, SPhilipps, EVargas, HMHutson, PHMacLeod, AM 4-Fluorosulfonylpiperidines: selective 5-HT2A ligands for the treatment of insomnia. Bioorg Med Chem Lett15:3665-9 (2005) 
 
5-hydroxytryptamine receptor 2C
Name:5-hydroxytryptamine receptor 2C
Type:G Protein-Coupled Receptor (GPCR)
Mol. Mass.:51836.79
Organism:Homo sapiens (Human)
Description:P28335
Residue:458
BDBM50108690
NameBDBM50108690
Synonyms:1-(2,4-difluorophenethyl)-4-(phenylsulfonyl)piperidine CHEMBL145939
TypeSmall organic molecule
Emp. Form.C19H21F2NO2S
Mol. Mass.365.437
SMILESFc1ccc(CCN2CCC(CC2)S(=O)(=O)c2ccccc2)c(F)c1