Reaction Details
TargetPotassium voltage-gated channel subfamily H member 2
LigandBDBM50108690
Substrate/Competitorn/a
Meas. Tech.ChEMBL_302272 (CHEMBL875187)
Ki 1000±n/a nM
Citation Fish, LRGilligan, MTHumphries, ACIvarsson, MLadduwahetty, TMerchant, KJO'Connor, DPatel, SPhilipps, EVargas, HMHutson, PHMacLeod, AM 4-Fluorosulfonylpiperidines: selective 5-HT2A ligands for the treatment of insomnia. Bioorg Med Chem Lett15:3665-9 (2005) 
 
Potassium voltage-gated channel subfamily H member 2
Name:Potassium voltage-gated channel subfamily H member 2
Type:Multi-pass membrane protein
Mol. Mass.:126672.65
Organism:Homo sapiens (Human)
Description:Q12809
Residue:1159
BDBM50108690
NameBDBM50108690
Synonyms:1-(2,4-difluorophenethyl)-4-(phenylsulfonyl)piperidine CHEMBL145939
TypeSmall organic molecule
Emp. Form.C19H21F2NO2S
Mol. Mass.365.437
SMILESFc1ccc(CCN2CCC(CC2)S(=O)(=O)c2ccccc2)c(F)c1