Reaction Details
Target5-hydroxytryptamine receptor 2A
LigandBDBM50169847
Substrate/Competitorn/a
Meas. Tech.ChEMBL_302363 (CHEMBL828082)
Ki 1±n/a nM
Citation Fish, LRGilligan, MTHumphries, ACIvarsson, MLadduwahetty, TMerchant, KJO'Connor, DPatel, SPhilipps, EVargas, HMHutson, PHMacLeod, AM 4-Fluorosulfonylpiperidines: selective 5-HT2A ligands for the treatment of insomnia. Bioorg Med Chem Lett15:3665-9 (2005) 
 
5-hydroxytryptamine receptor 2A
Name:5-hydroxytryptamine receptor 2A
Type:undefined
Mol. Mass.:52607.65
Organism:Homo sapiens (Human)
Description:P28223
Residue:471
BDBM50169847
NameBDBM50169847
Synonyms:4-(4-Azetidin-1-yl-benzenesulfonyl)-1-[2-(2,4-difluoro-phenyl)-ethyl]-4-fluoro-piperidine | CHEMBL176109
TypeSmall organic molecule
Emp. Form.C22H25F3N2O2S
Mol. Mass.438.506
SMILESFc1ccc(CCN2CCC(F)(CC2)S(=O)(=O)c2ccc(cc2)N2CCC2)c(F)c1