Reaction Details
Target5-hydroxytryptamine receptor 2C
LigandBDBM50108699
Substrate/Competitorn/a
Meas. Tech.ChEMBL_302364 (CHEMBL828083)
Ki 92±n/a nM
Citation Fish, LRGilligan, MTHumphries, ACIvarsson, MLadduwahetty, TMerchant, KJO'Connor, DPatel, SPhilipps, EVargas, HMHutson, PHMacLeod, AM 4-Fluorosulfonylpiperidines: selective 5-HT2A ligands for the treatment of insomnia. Bioorg Med Chem Lett15:3665-9 (2005) 
 
5-hydroxytryptamine receptor 2C
Name:5-hydroxytryptamine receptor 2C
Type:G Protein-Coupled Receptor (GPCR)
Mol. Mass.:51836.79
Organism:Homo sapiens (Human)
Description:P28335
Residue:458
BDBM50108699
NameBDBM50108699
Synonyms:1-(2,4-difluorophenethyl)-4-(4-fluorophenylsulfonyl)piperidine 1-[2-(2,4-Difluoro-phenyl)-ethyl]-4-(4-fluoro-benzenesulfonyl)-piperidine | CHEMBL358075
TypeSmall organic molecule
Emp. Form.C19H20F3NO2S
Mol. Mass.383.428
SMILESFc1ccc(cc1)S(=O)(=O)C1CCN(CCc2ccc(F)cc2F)CC1