Reaction Details
TargetAdenosine receptor A2b
LigandBDBM152260
Substrate/Competitorn/a
Meas. Tech.ChEMBL_2216599 (CHEMBL5129731)
Kd 140100±n/a nM
Citation Shepherd, CRobinson, SBerizzi, AThompson, LEJBird, LCulurgioni, SVarzandeh, SRawlins, PBOlsen, RHJNavratilova, IH Surface Plasmon Resonance Screening to Identify Active and Selective Adenosine Receptor Binding Fragments. ACS Med Chem Lett13:1172-1181 (2022) 
 
Adenosine receptor A2b
Name:Adenosine receptor A2b
Type:G Protein-Coupled Receptor (GPCR)
Mol. Mass.:36341.22
Organism:Homo sapiens (Human)
Description:n/a
Residue:332
BDBM152260
NameBDBM152260
Synonyms:US8993552, 1F4 Compound 44
TypeSmall organic molecule
Emp. Form.C10H10N4O
Mol. Mass.202.2126
SMILESCc1nn(nc1C(N)=O)-c1ccccc1