Reaction Details
TargetAdenosine receptor A2b
LigandBDBM50595372
Substrate/Competitorn/a
Meas. Tech.ChEMBL_2216599 (CHEMBL5129731)
Kd 22000±n/a nM
Citation Shepherd, CRobinson, SBerizzi, AThompson, LEJBird, LCulurgioni, SVarzandeh, SRawlins, PBOlsen, RHJNavratilova, IH Surface Plasmon Resonance Screening to Identify Active and Selective Adenosine Receptor Binding Fragments. ACS Med Chem Lett13:1172-1181 (2022) 
 
Adenosine receptor A2b
Name:Adenosine receptor A2b
Type:G Protein-Coupled Receptor (GPCR)
Mol. Mass.:36341.22
Organism:Homo sapiens (Human)
Description:n/a
Residue:332
BDBM50595372
NameBDBM50595372
Synonyms:CHEMBL5195119
TypeSmall organic molecule
Emp. Form.C14H11N3O2
Mol. Mass.253.256
SMILESO=C(NCc1ccccc1)c1ccc2nonc2c1