Reaction Details
TargetAdenosine receptor A2b
LigandBDBM50520329
Substrate/Competitorn/a
Meas. Tech.ChEMBL_2216599 (CHEMBL5129731)
Kd 123000±n/a nM
Citation Shepherd, CRobinson, SBerizzi, AThompson, LEJBird, LCulurgioni, SVarzandeh, SRawlins, PBOlsen, RHJNavratilova, IH Surface Plasmon Resonance Screening to Identify Active and Selective Adenosine Receptor Binding Fragments. ACS Med Chem Lett13:1172-1181 (2022) 
 
Adenosine receptor A2b
Name:Adenosine receptor A2b
Type:G Protein-Coupled Receptor (GPCR)
Mol. Mass.:36341.22
Organism:Homo sapiens (Human)
Description:n/a
Residue:332
BDBM50520329
NameBDBM50520329
Synonyms:CHEMBL4550896
TypeSmall organic molecule
Emp. Form.C14H10N2O2
Mol. Mass.238.2414
SMILESO=C(Nc1ccc2ccccc2n1)c1ccco1