Reaction Details
TargetAdenosine receptor A2b
LigandBDBM50595374
Substrate/Competitorn/a
Meas. Tech.ChEMBL_2216599 (CHEMBL5129731)
Kd 80000±n/a nM
Citation Shepherd, CRobinson, SBerizzi, AThompson, LEJBird, LCulurgioni, SVarzandeh, SRawlins, PBOlsen, RHJNavratilova, IH Surface Plasmon Resonance Screening to Identify Active and Selective Adenosine Receptor Binding Fragments. ACS Med Chem Lett13:1172-1181 (2022) 
 
Adenosine receptor A2b
Name:Adenosine receptor A2b
Type:G Protein-Coupled Receptor (GPCR)
Mol. Mass.:36341.22
Organism:Homo sapiens (Human)
Description:n/a
Residue:332
BDBM50595374
NameBDBM50595374
Synonyms:CHEMBL5197070
TypeSmall organic molecule
Emp. Form.C15H16N4O2
Mol. Mass.284.3131
SMILESCC(C)n1ncc2cc(cnc12)C(=O)NCc1ccco1