Reaction Details
TargetAdenosine receptor A2b
LigandBDBM50595378
Substrate/Competitorn/a
Meas. Tech.ChEMBL_2216599 (CHEMBL5129731)
Kd 148000±n/a nM
Citation Shepherd, CRobinson, SBerizzi, AThompson, LEJBird, LCulurgioni, SVarzandeh, SRawlins, PBOlsen, RHJNavratilova, IH Surface Plasmon Resonance Screening to Identify Active and Selective Adenosine Receptor Binding Fragments. ACS Med Chem Lett13:1172-1181 (2022) 
 
Adenosine receptor A2b
Name:Adenosine receptor A2b
Type:G Protein-Coupled Receptor (GPCR)
Mol. Mass.:36341.22
Organism:Homo sapiens (Human)
Description:n/a
Residue:332
BDBM50595378
NameBDBM50595378
Synonyms:CHEMBL5204663
TypeSmall organic molecule
Emp. Form.C9H8N2O2
Mol. Mass.176.172
SMILESCn1c(=O)[nH]c2ccccc2c1=O