Reaction Details
TargetAdenosine receptor A2b
LigandBDBM50595379
Substrate/Competitorn/a
Meas. Tech.ChEMBL_2216599 (CHEMBL5129731)
Kd 196000±n/a nM
Citation Shepherd, CRobinson, SBerizzi, AThompson, LEJBird, LCulurgioni, SVarzandeh, SRawlins, PBOlsen, RHJNavratilova, IH Surface Plasmon Resonance Screening to Identify Active and Selective Adenosine Receptor Binding Fragments. ACS Med Chem Lett13:1172-1181 (2022) 
 
Adenosine receptor A2b
Name:Adenosine receptor A2b
Type:G Protein-Coupled Receptor (GPCR)
Mol. Mass.:36341.22
Organism:Homo sapiens (Human)
Description:n/a
Residue:332
BDBM50595379
NameBDBM50595379
Synonyms:CHEMBL5193059
TypeSmall organic molecule
Emp. Form.C13H15N3O
Mol. Mass.229.2777
SMILESCC(C)NC(=O)c1cc([nH]n1)-c1ccccc1