Reaction Details
TargetAdenosine receptor A2b
LigandBDBM50595380
Substrate/Competitorn/a
Meas. Tech.ChEMBL_2216599 (CHEMBL5129731)
Kd 107000±n/a nM
Citation Shepherd, CRobinson, SBerizzi, AThompson, LEJBird, LCulurgioni, SVarzandeh, SRawlins, PBOlsen, RHJNavratilova, IH Surface Plasmon Resonance Screening to Identify Active and Selective Adenosine Receptor Binding Fragments. ACS Med Chem Lett13:1172-1181 (2022) 
 
Adenosine receptor A2b
Name:Adenosine receptor A2b
Type:G Protein-Coupled Receptor (GPCR)
Mol. Mass.:36341.22
Organism:Homo sapiens (Human)
Description:n/a
Residue:332
BDBM50595380
NameBDBM50595380
Synonyms:BENZOGUANAMINE
TypeSmall organic molecule
Emp. Form.C9H9N5
Mol. Mass.187.2013
SMILESNc1nc(N)nc(n1)-c1ccccc1