Reaction Details
TargetAdenosine receptor A2b
LigandBDBM50595381
Substrate/Competitorn/a
Meas. Tech.ChEMBL_2216599 (CHEMBL5129731)
Kd 45000±n/a nM
Citation Shepherd, CRobinson, SBerizzi, AThompson, LEJBird, LCulurgioni, SVarzandeh, SRawlins, PBOlsen, RHJNavratilova, IH Surface Plasmon Resonance Screening to Identify Active and Selective Adenosine Receptor Binding Fragments. ACS Med Chem Lett13:1172-1181 (2022) 
 
Adenosine receptor A2b
Name:Adenosine receptor A2b
Type:G Protein-Coupled Receptor (GPCR)
Mol. Mass.:36341.22
Organism:Homo sapiens (Human)
Description:n/a
Residue:332
BDBM50595381
NameBDBM50595381
Synonyms:CHEMBL5184937
TypeSmall organic molecule
Emp. Form.C8H6ClN3S
Mol. Mass.211.671
SMILESNc1nsc(n1)-c1ccc(Cl)cc1