Reaction Details
TargetAdenosine receptor A2b
LigandBDBM50275499
Substrate/Competitorn/a
Meas. Tech.ChEMBL_2216599 (CHEMBL5129731)
Kd 280±n/a nM
Citation Shepherd, CRobinson, SBerizzi, AThompson, LEJBird, LCulurgioni, SVarzandeh, SRawlins, PBOlsen, RHJNavratilova, IH Surface Plasmon Resonance Screening to Identify Active and Selective Adenosine Receptor Binding Fragments. ACS Med Chem Lett13:1172-1181 (2022) 
 
Adenosine receptor A2b
Name:Adenosine receptor A2b
Type:G Protein-Coupled Receptor (GPCR)
Mol. Mass.:36341.22
Organism:Homo sapiens (Human)
Description:n/a
Residue:332
BDBM50275499
NameBDBM50275499
Synonyms:2-(4-fluorophenyl)-3-(4-pyridinyl)pyrazolo-[1,5-a]pyridine | CHEMBL485745
TypeSmall organic molecule
Emp. Form.C18H12FN3
Mol. Mass.289.3064
SMILESFc1ccc(cc1)-c1nn2ccccc2c1-c1ccncc1