Reaction Details
TargetMuscarinic acetylcholine receptor M3
LigandBDBM50595406
Substrate/Competitorn/a
Meas. Tech.ChEMBL_2216667 (CHEMBL5129799)
Ki 0.794328±n/a nM
Citation Carzaniga, LLinney, IDRizzi, ADelcanale, MSchmidt, WKnight, CKPastore, FMiglietta, DCarnini, CCesari, NRiccardi, BMileo, VVenturi, LMoretti, EBlackaby, WPPatacchini, RAccetta, ABiagetti, MBassani, FTondelli, MMurgo, ABattipaglia, LVilletti, GPuccini, PCatinella, SCivelli, MRancati, F Discovery of Clinical Candidate CHF-6366: A Novel Super-soft Dual Pharmacology Muscarinic Antagonist and ? J Med Chem65:10233-10250 (2022) 
 
Muscarinic acetylcholine receptor M3
Name:Muscarinic acetylcholine receptor M3
Type:Enzyme
Mol. Mass.:66151.03
Organism:Homo sapiens (Human)
Description:P20309
Residue:590
BDBM50595406
NameBDBM50595406
Synonyms:CHEMBL5200448
TypeSmall organic molecule
Emp. Form.C30H32N2O5
Mol. Mass.500.5855
SMILESCOC(=O)c1ccc(COc2cccc(c2)[C@@H](NC(=O)O[C@H]2CN3CCC2CC3)c2ccccc2)cc1