Reaction Details
TargetMuscarinic acetylcholine receptor M3
LigandBDBM50595427
Substrate/Competitorn/a
Meas. Tech.ChEMBL_2216667 (CHEMBL5129799)
Ki 0.199526±n/a nM
Citation Carzaniga, LLinney, IDRizzi, ADelcanale, MSchmidt, WKnight, CKPastore, FMiglietta, DCarnini, CCesari, NRiccardi, BMileo, VVenturi, LMoretti, EBlackaby, WPPatacchini, RAccetta, ABiagetti, MBassani, FTondelli, MMurgo, ABattipaglia, LVilletti, GPuccini, PCatinella, SCivelli, MRancati, F Discovery of Clinical Candidate CHF-6366: A Novel Super-soft Dual Pharmacology Muscarinic Antagonist and ? J Med Chem65:10233-10250 (2022) 
 
Muscarinic acetylcholine receptor M3
Name:Muscarinic acetylcholine receptor M3
Type:Enzyme
Mol. Mass.:66151.03
Organism:Homo sapiens (Human)
Description:P20309
Residue:590
BDBM50595427
NameBDBM50595427
Synonyms:CHEMBL5200887
TypeSmall organic molecule
Emp. Form.C45H50N4O9
Mol. Mass.790.8999
SMILESCOc1cc(ccc1COc1cccc(c1)[C@@H](NC(=O)O[C@H]1CN2CCC1CC2)c1ccccc1)C(=O)OCCCCNC[C@H](O)c1ccc(O)c2[nH]c(=O)ccc12