Reaction Details
TargetBeta-2 adrenergic receptor
LigandBDBM50595405
Substrate/Competitorn/a
Meas. Tech.ChEMBL_2216668 (CHEMBL5129800)
Ki 0.050119±n/a nM
Citation Carzaniga, LLinney, IDRizzi, ADelcanale, MSchmidt, WKnight, CKPastore, FMiglietta, DCarnini, CCesari, NRiccardi, BMileo, VVenturi, LMoretti, EBlackaby, WPPatacchini, RAccetta, ABiagetti, MBassani, FTondelli, MMurgo, ABattipaglia, LVilletti, GPuccini, PCatinella, SCivelli, MRancati, F Discovery of Clinical Candidate CHF-6366: A Novel Super-soft Dual Pharmacology Muscarinic Antagonist and ? J Med Chem65:10233-10250 (2022) 
 
Beta-2 adrenergic receptor
Name:Beta-2 adrenergic receptor
Type:n/a
Mol. Mass.:46461.69
Organism:Homo sapiens (Human)
Description:P07550
Residue:413
BDBM50595405
NameBDBM50595405
Synonyms:CHEMBL5184598
TypeSmall organic molecule
Emp. Form.C44H48N4O8
Mol. Mass.760.8739
SMILESO[C@@H](CNCCCCOC(=O)c1ccc(COc2cccc(c2)[C@H](NC(=O)O[C@H]2CN3CCC2CC3)c2ccccc2)cc1)c1ccc(O)c2[nH]c(=O)ccc12