Reaction Details
TargetMetabotropic glutamate receptor 2
LigandBDBM50170307
Substrate/Competitorn/a
Meas. Tech.ChEMBL_304368 (CHEMBL829010)
EC50 788±n/a nM
Citation Govek, SPBonnefous, CHutchinson, JHKamenecka, TMcQuiston, JPracitto, RZhao, LXGardner, MFJames, JKDaggett, LPRowe, BASchaffhauser, HBristow, LJCampbell, UCRodriguez, DEVernier, JM Benzazoles as allosteric potentiators of metabotropic glutamate receptor 2 (mGluR2): efficacy in an animal model for schizophrenia. Bioorg Med Chem Lett15:4068-72 (2005) 
 
Metabotropic glutamate receptor 2
Name:Metabotropic glutamate receptor 2
Type:Enzyme
Mol. Mass.:95584.88
Organism:Homo sapiens (Human)
Description:Q14416
Residue:872
BDBM50170307
NameBDBM50170307
Synonyms:3-(2,2-Dimethyl-propyl)-7-propyl-6-{4-[4-(1H-tetrazol-5-yl)-phenoxy]-butoxy}-benzo[d]isoxazole | CHEMBL188977
TypeSmall organic molecule
Emp. Form.C26H33N5O3
Mol. Mass.463.5719
SMILESCCCc1c(OCCCCOc2ccc(cc2)-c2nnn[nH]2)ccc2c(CC(C)(C)C)noc12