Reaction Details
TargetMetabotropic glutamate receptor 2
LigandBDBM50170315
Substrate/Competitorn/a
Meas. Tech.ChEMBL_304368 (CHEMBL829010)
EC50 1172±n/a nM
Citation Govek, SPBonnefous, CHutchinson, JHKamenecka, TMcQuiston, JPracitto, RZhao, LXGardner, MFJames, JKDaggett, LPRowe, BASchaffhauser, HBristow, LJCampbell, UCRodriguez, DEVernier, JM Benzazoles as allosteric potentiators of metabotropic glutamate receptor 2 (mGluR2): efficacy in an animal model for schizophrenia. Bioorg Med Chem Lett15:4068-72 (2005) 
 
Metabotropic glutamate receptor 2
Name:Metabotropic glutamate receptor 2
Type:Enzyme
Mol. Mass.:95584.88
Organism:Homo sapiens (Human)
Description:Q14416
Residue:872
BDBM50170315
NameBDBM50170315
Synonyms:1-(2,2-Dimethyl-propyl)-4-propyl-5-{4-[4-(1H-tetrazol-5-yl)-phenoxy]-butoxy}-2,3-dihydro-1H-indole | CHEMBL365440
TypeSmall organic molecule
Emp. Form.C27H37N5O2
Mol. Mass.463.615
SMILESCCCc1c2CCN(CC(C)(C)C)c2ccc1OCCCCOc1ccc(cc1)-c1nnn[nH]1