Reaction Details
TargetMetabotropic glutamate receptor 2
LigandBDBM50170316
Substrate/Competitorn/a
Meas. Tech.ChEMBL_304368 (CHEMBL829010)
EC50 879±n/a nM
Citation Govek, SPBonnefous, CHutchinson, JHKamenecka, TMcQuiston, JPracitto, RZhao, LXGardner, MFJames, JKDaggett, LPRowe, BASchaffhauser, HBristow, LJCampbell, UCRodriguez, DEVernier, JM Benzazoles as allosteric potentiators of metabotropic glutamate receptor 2 (mGluR2): efficacy in an animal model for schizophrenia. Bioorg Med Chem Lett15:4068-72 (2005) 
 
Metabotropic glutamate receptor 2
Name:Metabotropic glutamate receptor 2
Type:Enzyme
Mol. Mass.:95584.88
Organism:Homo sapiens (Human)
Description:Q14416
Residue:872
BDBM50170316
NameBDBM50170316
Synonyms:1-(2,2-Dimethyl-propyl)-4-propyl-5-{4-[4-(1H-tetrazol-5-yl)-phenoxy]-benzyloxy}-1H-indole | CHEMBL189290
TypeSmall organic molecule
Emp. Form.C30H33N5O2
Mol. Mass.495.6153
SMILESCCCc1c(OCc2ccc(Oc3ccc(cc3)-c3nnn[nH]3)cc2)ccc2n(CC(C)(C)C)ccc12