Reaction Details
TargetMetabotropic glutamate receptor 2
LigandBDBM50153757
Substrate/Competitorn/a
Meas. Tech.ChEMBL_304368 (CHEMBL829010)
EC50 348±n/a nM
Citation Govek, SPBonnefous, CHutchinson, JHKamenecka, TMcQuiston, JPracitto, RZhao, LXGardner, MFJames, JKDaggett, LPRowe, BASchaffhauser, HBristow, LJCampbell, UCRodriguez, DEVernier, JM Benzazoles as allosteric potentiators of metabotropic glutamate receptor 2 (mGluR2): efficacy in an animal model for schizophrenia. Bioorg Med Chem Lett15:4068-72 (2005) 
 
Metabotropic glutamate receptor 2
Name:Metabotropic glutamate receptor 2
Type:Enzyme
Mol. Mass.:95584.88
Organism:Homo sapiens (Human)
Description:Q14416
Residue:872
BDBM50153757
NameBDBM50153757
Synonyms:1-(2-Hydroxy-3-propyl-4-{4-[4-(1H-tetrazol-5-yl)-phenoxy]-butoxy}-phenyl)-ethanone CHEMBL182371
TypeSmall organic molecule
Emp. Form.C22H26N4O4
Mol. Mass.410.4662
SMILESCCCc1c(OCCCCOc2ccc(cc2)-c2nnn[nH]2)ccc(C(C)=O)c1O