Reaction Details
TargetMetabotropic glutamate receptor 2
LigandBDBM50170328
Substrate/Competitorn/a
Meas. Tech.ChEMBL_304368 (CHEMBL829010)
EC50 3544±n/a nM
Citation Govek, SPBonnefous, CHutchinson, JHKamenecka, TMcQuiston, JPracitto, RZhao, LXGardner, MFJames, JKDaggett, LPRowe, BASchaffhauser, HBristow, LJCampbell, UCRodriguez, DEVernier, JM Benzazoles as allosteric potentiators of metabotropic glutamate receptor 2 (mGluR2): efficacy in an animal model for schizophrenia. Bioorg Med Chem Lett15:4068-72 (2005) 
 
Metabotropic glutamate receptor 2
Name:Metabotropic glutamate receptor 2
Type:Enzyme
Mol. Mass.:95584.88
Organism:Homo sapiens (Human)
Description:Q14416
Residue:872
BDBM50170328
NameBDBM50170328
Synonyms:1-(2,2-Dimethyl-propyl)-4-propyl-5-{3-[4-(1H-tetrazol-5-yl)-phenoxy]-propoxy}-1H-indole | CHEMBL189516
TypeSmall organic molecule
Emp. Form.C26H33N5O2
Mol. Mass.447.5725
SMILESCCCc1c(OCCCOc2ccc(cc2)-c2nnn[nH]2)ccc2n(CC(C)(C)C)ccc12