Reaction Details
TargetCannabinoid receptor 1
LigandBDBM50170333
Substrate/Competitorn/a
Meas. Tech.ChEMBL_310455 (CHEMBL834400)
EC50 29.3±n/a nM
Citation Huffman, JWSzklennik, PVAlmond, ABushell, KSelley, DEHe, HCassidy, MPWiley, JLMartin, BR 1-Pentyl-3-phenylacetylindoles, a new class of cannabimimetic indoles. Bioorg Med Chem Lett15:4110-3 (2005) 
 
Cannabinoid receptor 1
Name:Cannabinoid receptor 1
Type:G Protein-Coupled Receptor (GPCR)
Mol. Mass.:52856.55
Organism:Rattus norvegicus (rat)
Description:P20272
Residue:473
BDBM50170333
NameBDBM50170333
Synonyms:2-(3-Methoxy-phenyl)-1-(1-pentyl-1H-indol-3-yl)-ethanone CHEMBL186674 | JWH-302
TypeSmall organic molecule
Emp. Form.C22H25NO2
Mol. Mass.335.4394
SMILESCCCCCn1cc(C(=O)Cc2cccc(OC)c2)c2ccccc12