Reaction Details
TargetCannabinoid receptor 1
LigandBDBM50170350
Substrate/Competitorn/a
Meas. Tech.ChEMBL_302852 (CHEMBL828768)
Ki 1598±n/a nM
Citation Huffman, JWSzklennik, PVAlmond, ABushell, KSelley, DEHe, HCassidy, MPWiley, JLMartin, BR 1-Pentyl-3-phenylacetylindoles, a new class of cannabimimetic indoles. Bioorg Med Chem Lett15:4110-3 (2005) 
 
Cannabinoid receptor 1
Name:Cannabinoid receptor 1
Type:G Protein-Coupled Receptor (GPCR)
Mol. Mass.:52856.55
Organism:Rattus norvegicus (rat)
Description:P20272
Residue:473
BDBM50170350
NameBDBM50170350
Synonyms:2-(4-Chloro-phenyl)-1-(2-methyl-1-pentyl-1H-indol-3-yl)-ethanone CHEMBL187813 | JWH-207
TypeSmall organic molecule
Emp. Form.C22H24ClNO
Mol. Mass.353.885
SMILESCCCCCn1c(C)c(C(=O)Cc2ccc(Cl)cc2)c2ccccc12