Reaction Details
TargetCannabinoid receptor 1
LigandBDBM50170355
Substrate/Competitorn/a
Meas. Tech.ChEMBL_302852 (CHEMBL828768)
Ki 117±n/a nM
Citation Huffman, JWSzklennik, PVAlmond, ABushell, KSelley, DEHe, HCassidy, MPWiley, JLMartin, BR 1-Pentyl-3-phenylacetylindoles, a new class of cannabimimetic indoles. Bioorg Med Chem Lett15:4110-3 (2005) 
 
Cannabinoid receptor 1
Name:Cannabinoid receptor 1
Type:G Protein-Coupled Receptor (GPCR)
Mol. Mass.:52856.55
Organism:Rattus norvegicus (rat)
Description:P20272
Residue:473
BDBM50170355
NameBDBM50170355
Synonyms:2-(3-Chloro-phenyl)-1-(2-methyl-1-pentyl-1H-indol-3-yl)-ethanone CHEMBL188910 | JWH-303
TypeSmall organic molecule
Emp. Form.C22H24ClNO
Mol. Mass.353.885
SMILESCCCCCn1c(C)c(C(=O)Cc2cccc(Cl)c2)c2ccccc12