Reaction Details
TargetCannabinoid receptor 1
LigandBDBM50170338
Substrate/Competitorn/a
Meas. Tech.ChEMBL_302852 (CHEMBL828768)
Ki 90±n/a nM
Citation Huffman, JWSzklennik, PVAlmond, ABushell, KSelley, DEHe, HCassidy, MPWiley, JLMartin, BR 1-Pentyl-3-phenylacetylindoles, a new class of cannabimimetic indoles. Bioorg Med Chem Lett15:4110-3 (2005) 
 
Cannabinoid receptor 1
Name:Cannabinoid receptor 1
Type:G Protein-Coupled Receptor (GPCR)
Mol. Mass.:52856.55
Organism:Rattus norvegicus (rat)
Description:P20272
Residue:473
BDBM50170338
NameBDBM50170338
Synonyms:1-(1-Pentyl-1H-indol-3-yl)-2-phenyl-ethanone CHEMBL365878 | JWH-167
TypeSmall organic molecule
Emp. Form.C21H23NO
Mol. Mass.305.4134
SMILESCCCCCn1cc(C(=O)Cc2ccccc2)c2ccccc12