Reaction Details
TargetCannabinoid receptor 2
LigandBDBM50170330
Substrate/Competitorn/a
Meas. Tech.ChEMBL_302853 (CHEMBL828769)
Ki 365±n/a nM
Citation Huffman, JWSzklennik, PVAlmond, ABushell, KSelley, DEHe, HCassidy, MPWiley, JLMartin, BR 1-Pentyl-3-phenylacetylindoles, a new class of cannabimimetic indoles. Bioorg Med Chem Lett15:4110-3 (2005) 
 
Cannabinoid receptor 2
Name:Cannabinoid receptor 2
Type:G Protein-Coupled Receptor (GPCR)
Mol. Mass.:39690.94
Organism:Homo sapiens (Human)
Description:P34972
Residue:360
BDBM50170330
NameBDBM50170330
Synonyms:2-(4-Fluoro-phenyl)-1-(1-pentyl-1H-indol-3-yl)-ethanone CHEMBL187412 | JWH-313
TypeSmall organic molecule
Emp. Form.C21H22FNO
Mol. Mass.323.4039
SMILESCCCCCn1cc(C(=O)Cc2ccc(F)cc2)c2ccccc12