Reaction Details
TargetCannabinoid receptor 1
LigandBDBM50170352
Substrate/Competitorn/a
Meas. Tech.ChEMBL_302852 (CHEMBL828768)
Ki 1678±n/a nM
Citation Huffman, JWSzklennik, PVAlmond, ABushell, KSelley, DEHe, HCassidy, MPWiley, JLMartin, BR 1-Pentyl-3-phenylacetylindoles, a new class of cannabimimetic indoles. Bioorg Med Chem Lett15:4110-3 (2005) 
 
Cannabinoid receptor 1
Name:Cannabinoid receptor 1
Type:G Protein-Coupled Receptor (GPCR)
Mol. Mass.:52856.55
Organism:Rattus norvegicus (rat)
Description:P20272
Residue:473
BDBM50170352
NameBDBM50170352
Synonyms:2-(4-Methoxy-phenyl)-1-(2-methyl-1-pentyl-1H-indol-3-yl)-ethanone CHEMBL364111 | JWH-202
TypeSmall organic molecule
Emp. Form.C23H27NO2
Mol. Mass.349.466
SMILESCCCCCn1c(C)c(C(=O)Cc2ccc(OC)cc2)c2ccccc12