Reaction Details
TargetCannabinoid receptor 1
LigandBDBM50170353
Substrate/Competitorn/a
Meas. Tech.ChEMBL_302852 (CHEMBL828768)
Ki 1064±n/a nM
Citation Huffman, JWSzklennik, PVAlmond, ABushell, KSelley, DEHe, HCassidy, MPWiley, JLMartin, BR 1-Pentyl-3-phenylacetylindoles, a new class of cannabimimetic indoles. Bioorg Med Chem Lett15:4110-3 (2005) 
 
Cannabinoid receptor 1
Name:Cannabinoid receptor 1
Type:G Protein-Coupled Receptor (GPCR)
Mol. Mass.:52856.55
Organism:Rattus norvegicus (rat)
Description:P20272
Residue:473
BDBM50170353
NameBDBM50170353
Synonyms:2-(4-Methoxy-phenyl)-1-(1-pentyl-1H-indol-3-yl)-ethanone CHEMBL188940 | JWH-201
TypeSmall organic molecule
Emp. Form.C22H25NO2
Mol. Mass.335.4394
SMILESCCCCCn1cc(C(=O)Cc2ccc(OC)cc2)c2ccccc12