Reaction Details
TargetMelanin-concentrating hormone receptor 1
LigandBDBM50170395
Substrate/Competitorn/a
Meas. Tech.ChEMBL_303115 (CHEMBL829624)
Ki 2.3±n/a nM
Citation Huang, CQBaker, TSchwarz, DFan, JHeise, CEZhang, MGoodfellow, VSMarkison, SGogas, KRChen, TWang, XCZhu, YF 1-(4-Amino-phenyl)-pyrrolidin-3-yl-amine and 6-(3-amino-pyrrolidin-1-yl)-pyridin-3-yl-amine derivatives as melanin-concentrating hormone receptor-1 antagonists. Bioorg Med Chem Lett15:3701-6 (2005) 
 
Melanin-concentrating hormone receptor 1
Name:Melanin-concentrating hormone receptor 1
Type:G Protein-Coupled Receptor (GPCR)
Mol. Mass.:45976.27
Organism:Homo sapiens (Human)
Description:Membranes from CHO-K1 cells stably expressing human MCH1R were used in assays.
Residue:422
BDBM50170395
NameBDBM50170395
Synonyms:Biphenyl-4-carboxylic acid [6-(3-methylamino-pyrrolidin-1-yl)-pyridin-3-yl]-amide | CHEMBL425518
TypeSmall organic molecule
Emp. Form.C23H24N4O
Mol. Mass.372.4629
SMILESCNC1CCN(C1)c1ccc(NC(=O)c2ccc(cc2)-c2ccccc2)cn1