Reaction Details
TargetNitric oxide synthase, brain
LigandBDBM50081585
Substrate/Competitorn/a
Meas. Tech.ChEMBL_306605 (CHEMBL833495)
IC50 34720.0±n/a nM
Citation Matter, HKumar, HSFedorov, RFrey, AKotsonis, PHartmann, EFröhlich, LGReif, APfleiderer, WScheurer, PGhosh, DKSchlichting, ISchmidt, HH Structural analysis of isoform-specific inhibitors targeting the tetrahydrobiopterin binding site of human nitric oxide synthases. J Med Chem48:4783-92 (2005) 
 
Nitric oxide synthase, brain
Name:Nitric oxide synthase, brain
Type:Homodimer
Mol. Mass.:160985.98
Organism:Homo sapiens (Human)
Description:P29475
Residue:1434
BDBM50081585
NameBDBM50081585
Synonyms:CHEMBL100659 | N*4*,N*4*-Dibenzyl-6-(4-methoxy-phenyl)-pteridine-2,4-diamine
TypeSmall organic molecule
Emp. Form.C27H24N6O
Mol. Mass.448.5191
SMILESCOc1ccc(cc1)-c1cnc2nc(N)nc(N(Cc3ccccc3)Cc3ccccc3)c2n1