Reaction Details
TargetNitric oxide synthase, inducible
LigandBDBM50081588
Substrate/Competitorn/a
Meas. Tech.ChEMBL_306628 (CHEMBL829930)
IC50 1700±n/a nM
Citation Matter, HKumar, HSFedorov, RFrey, AKotsonis, PHartmann, EFröhlich, LGReif, APfleiderer, WScheurer, PGhosh, DKSchlichting, ISchmidt, HH Structural analysis of isoform-specific inhibitors targeting the tetrahydrobiopterin binding site of human nitric oxide synthases. J Med Chem48:4783-92 (2005) 
 
Nitric oxide synthase, inducible
Name:Nitric oxide synthase, inducible
Type:Homodimer
Mol. Mass.:131141.95
Organism:Homo sapiens (Human)
Description:P35228
Residue:1153
BDBM50081588
NameBDBM50081588
Synonyms:1-(2,4-Diamino-5,6,7,8-tetrahydro-pteridin-6-yl)-propane-1,2-diol | CHEMBL318427
TypeSmall organic molecule
Emp. Form.C9H16N6O2
Mol. Mass.240.2623
SMILESCC(O)C(O)C1CNc2nc(N)nc(N)c2N1