Reaction Details
TargetNitric oxide synthase, brain
LigandBDBM50081588
Substrate/Competitorn/a
Meas. Tech.ChEMBL_306605 (CHEMBL833495)
IC50 1260±n/a nM
Citation Matter, HKumar, HSFedorov, RFrey, AKotsonis, PHartmann, EFröhlich, LGReif, APfleiderer, WScheurer, PGhosh, DKSchlichting, ISchmidt, HH Structural analysis of isoform-specific inhibitors targeting the tetrahydrobiopterin binding site of human nitric oxide synthases. J Med Chem48:4783-92 (2005) 
 
Nitric oxide synthase, brain
Name:Nitric oxide synthase, brain
Type:Homodimer
Mol. Mass.:160985.98
Organism:Homo sapiens (Human)
Description:P29475
Residue:1434
BDBM50081588
NameBDBM50081588
Synonyms:1-(2,4-Diamino-5,6,7,8-tetrahydro-pteridin-6-yl)-propane-1,2-diol | CHEMBL318427
TypeSmall organic molecule
Emp. Form.C9H16N6O2
Mol. Mass.240.2623
SMILESCC(O)C(O)C1CNc2nc(N)nc(N)c2N1