Reaction Details
Target3-dehydroquinate dehydratase
LigandBDBM50170803
Substrate/Competitorn/a
Meas. Tech.ChEMBL_303647 (CHEMBL828995)
pH8.2±n/a
Ki 1800±n/a nM
Commentsextracted
Citation Sánchez-Sixto, CPrazeres, VFCastedo, LLamb, HHawkins, ARGonzález-Bello, C Structure-based design, synthesis, and biological evaluation of inhibitors of Mycobacterium tuberculosis type II dehydroquinase. J Med Chem48:4871-81 (2005) 
 
3-dehydroquinate dehydratase
Name:3-dehydroquinate dehydratase
Type:PROTEIN
Mol. Mass.:15786.25
Organism:Mycobacterium tuberculosis
Description:ChEMBL_766423
Residue:147
BDBM50170803
NameBDBM50170803
Synonyms:(1R,4R,5R)-3-(4-Fluoro-phenyl)-1,4,5-trihydroxy-cyclohex-2-enecarboxylic acid | CHEMBL362122
TypeSmall organic molecule
Emp. Form.C13H13FO5
Mol. Mass.268.2377
SMILESO[C@@H]1C[C@@](O)(C=C([C@H]1O)c1ccc(F)cc1)C(O)=O