Reaction Details
Target3-dehydroquinate dehydratase
LigandBDBM50170813
Substrate/Competitorn/a
Meas. Tech.ChEMBL_303647 (CHEMBL828995)
pH8.2±n/a
Ki 10000±n/a nM
Commentsextracted
Citation Sánchez-Sixto, CPrazeres, VFCastedo, LLamb, HHawkins, ARGonzález-Bello, C Structure-based design, synthesis, and biological evaluation of inhibitors of Mycobacterium tuberculosis type II dehydroquinase. J Med Chem48:4871-81 (2005) 
 
3-dehydroquinate dehydratase
Name:3-dehydroquinate dehydratase
Type:PROTEIN
Mol. Mass.:15786.25
Organism:Mycobacterium tuberculosis
Description:ChEMBL_766423
Residue:147
BDBM50170813
NameBDBM50170813
Synonyms:(1R,4S,5R)-3-Fluoro-1,4,5-trihydroxy-cyclohex-2-enecarboxylic acid CHEMBL365468
TypeSmall organic molecule
Emp. Form.C7H9FO5
Mol. Mass.192.1418
SMILESO[C@@H]1C[C@@](O)(C=C(F)[C@H]1O)C(O)=O