Reaction Details
TargetAdenosine receptor A3
LigandBDBM50170816
Substrate/Competitorn/a
Meas. Tech.ChEMBL_303319 (CHEMBL840044)
Ki 47±n/a nM
Citation Perreira, MJiang, JKKlutz, AMGao, ZGShainberg, ALu, CThomas, CJJacobson, KA "Reversine" and its 2-substituted adenine derivatives as potent and selective A3 adenosine receptor antagonists. J Med Chem48:4910-8 (2005) 
 
Adenosine receptor A3
Name:Adenosine receptor A3
Type:G Protein-Coupled Receptor (GPCR)
Mol. Mass.:36197.32
Organism:Homo sapiens (Human)
Description:P0DMS8
Residue:318
BDBM50170816
NameBDBM50170816
Synonyms:CHEMBL363419 | Cyclohexyl-(2-phenoxy-9H-purin-6-yl)-amine
TypeSmall organic molecule
Emp. Form.C17H19N5O
Mol. Mass.309.3657
SMILESC1CCC(CC1)Nc1nc(Oc2ccccc2)nc2nc[nH]c12