Reaction Details
TargetAdenosine receptor A2a
LigandBDBM50170823
Substrate/Competitorn/a
Meas. Tech.ChEMBL_303486 (CHEMBL838860)
Ki 6100±n/a nM
Citation Perreira, MJiang, JKKlutz, AMGao, ZGShainberg, ALu, CThomas, CJJacobson, KA "Reversine" and its 2-substituted adenine derivatives as potent and selective A3 adenosine receptor antagonists. J Med Chem48:4910-8 (2005) 
 
Adenosine receptor A2a
Name:Adenosine receptor A2a
Type:G Protein-Coupled Receptor (GPCR)
Mol. Mass.:44716.46
Organism:Homo sapiens (Human)
Description:P29274
Residue:412
BDBM50170823
NameBDBM50170823
Synonyms:CHEMBL366216 | N*6*-Cyclohexyl-N*2*-(4-dimethylamino-phenyl)-9H-purine-2,6-diamine
TypeSmall organic molecule
Emp. Form.C19H25N7
Mol. Mass.351.4487
SMILESCN(C)c1ccc(Nc2nc(NC3CCCCC3)c3[nH]cnc3n2)cc1