Reaction Details
TargetAdenosine receptor A1
LigandBDBM50170818
Substrate/Competitorn/a
Meas. Tech.ChEMBL_303144 (CHEMBL829118)
Ki 3000±n/a nM
Citation Perreira, MJiang, JKKlutz, AMGao, ZGShainberg, ALu, CThomas, CJJacobson, KA "Reversine" and its 2-substituted adenine derivatives as potent and selective A3 adenosine receptor antagonists. J Med Chem48:4910-8 (2005) 
 
Adenosine receptor A1
Name:Adenosine receptor A1
Type:G Protein-Coupled Receptor (GPCR)
Mol. Mass.:36520.92
Organism:Homo sapiens (Human)
Description:P30542
Residue:326
BDBM50170818
NameBDBM50170818
Synonyms:CHEMBL191270 | Cyclohexyl-(2-phenylsulfanyl-9H-purin-6-yl)-amine
TypeSmall organic molecule
Emp. Form.C17H19N5S
Mol. Mass.325.431
SMILESC1CCC(CC1)Nc1nc(Sc2ccccc2)nc2nc[nH]c12