Reaction Details
TargetAdenosine receptor A3
LigandBDBM50170827
Substrate/Competitorn/a
Meas. Tech.ChEMBL_303319 (CHEMBL840044)
Ki 122±n/a nM
Citation Perreira, MJiang, JKKlutz, AMGao, ZGShainberg, ALu, CThomas, CJJacobson, KA "Reversine" and its 2-substituted adenine derivatives as potent and selective A3 adenosine receptor antagonists. J Med Chem48:4910-8 (2005) 
 
Adenosine receptor A3
Name:Adenosine receptor A3
Type:G Protein-Coupled Receptor (GPCR)
Mol. Mass.:36197.32
Organism:Homo sapiens (Human)
Description:P0DMS8
Residue:318
BDBM50170827
NameBDBM50170827
Synonyms:CHEMBL446698 | N*6*-Bicyclo[2.2.1]hept-2-yl-N*2*-(4-morpholin-4-yl-phenyl)-9H-purine-2,6-diamine
TypeSmall organic molecule
Emp. Form.C22H27N7O
Mol. Mass.405.4961
SMILESC1CC2CC1CC2Nc1nc(Nc2ccc(cc2)N2CCOCC2)nc2nc[nH]c12