Reaction Details
TargetAdenosine receptor A3
LigandBDBM50170837
Substrate/Competitorn/a
Meas. Tech.ChEMBL_303319 (CHEMBL840044)
Ki 2770±n/a nM
Citation Perreira, MJiang, JKKlutz, AMGao, ZGShainberg, ALu, CThomas, CJJacobson, KA "Reversine" and its 2-substituted adenine derivatives as potent and selective A3 adenosine receptor antagonists. J Med Chem48:4910-8 (2005) 
 
Adenosine receptor A3
Name:Adenosine receptor A3
Type:G Protein-Coupled Receptor (GPCR)
Mol. Mass.:36197.32
Organism:Homo sapiens (Human)
Description:P0DMS8
Residue:318
BDBM50170837
NameBDBM50170837
Synonyms:CHEMBL187336 | N*6*-Cyclooctyl-N*2*-(4-morpholin-4-yl-phenyl)-9H-purine-2,6-diamine
TypeSmall organic molecule
Emp. Form.C23H31N7O
Mol. Mass.421.5385
SMILESC1CN(CCO1)c1ccc(Nc2nc(NC3CCCCCCC3)c3[nH]cnc3n2)cc1