Reaction Details
TargetAdenosine receptor A3
LigandBDBM50170820
Substrate/Competitorn/a
Meas. Tech.ChEMBL_303319 (CHEMBL840044)
Ki 1460±n/a nM
Citation Perreira, MJiang, JKKlutz, AMGao, ZGShainberg, ALu, CThomas, CJJacobson, KA "Reversine" and its 2-substituted adenine derivatives as potent and selective A3 adenosine receptor antagonists. J Med Chem48:4910-8 (2005) 
 
Adenosine receptor A3
Name:Adenosine receptor A3
Type:G Protein-Coupled Receptor (GPCR)
Mol. Mass.:36197.32
Organism:Homo sapiens (Human)
Description:P0DMS8
Residue:318
BDBM50170820
NameBDBM50170820
Synonyms:CHEMBL426076 | N*6*-Cyclohexyl-N*2*-(2-ethyl-phenyl)-9H-purine-2,6-diamine
TypeSmall organic molecule
Emp. Form.C19H24N6
Mol. Mass.336.4341
SMILESCCc1ccccc1Nc1nc(NC2CCCCC2)c2[nH]cnc2n1