Reaction Details
TargetAdenosine receptor A2a
LigandBDBM50170831
Substrate/Competitorn/a
Meas. Tech.ChEMBL_303486 (CHEMBL838860)
Ki>10000±n/a nM
Citation Perreira, MJiang, JKKlutz, AMGao, ZGShainberg, ALu, CThomas, CJJacobson, KA "Reversine" and its 2-substituted adenine derivatives as potent and selective A3 adenosine receptor antagonists. J Med Chem48:4910-8 (2005) 
 
Adenosine receptor A2a
Name:Adenosine receptor A2a
Type:G Protein-Coupled Receptor (GPCR)
Mol. Mass.:44716.46
Organism:Homo sapiens (Human)
Description:P29274
Residue:412
BDBM50170831
NameBDBM50170831
Synonyms:CHEMBL188343 N6-cyclohexyl-N2-(4-morpholinophenyl)-9H-purine-2,6-diamine | N~6~-cyclohexyl-N~2~-(4-morpholin-4-ylphenyl)-9H-purine-2,6-diamine
TypeSmall organic molecule
Emp. Form.C21H27N7O
Mol. Mass.393.4854
SMILESC1CCC(CC1)Nc1nc(Nc2ccc(cc2)N2CCOCC2)nc2nc[nH]c12