Reaction Details
TargetLysophosphatidic acid receptor 3
LigandBDBM50170846
Substrate/Competitorn/a
Meas. Tech.ChEMBL_312537 (CHEMBL832580)
IC50 3100±n/a nM
Citation Durgam, GGVirag, TWalker, MDTsukahara, RYasuda, SLiliom, Kvan Meeteren, LAMoolenaar, WHWilke, NSiess, WTigyi, GMiller, DD Synthesis, structure-activity relationships, and biological evaluation of fatty alcohol phosphates as lysophosphatidic acid receptor ligands, activators of PPARgamma, and inhibitors of autotaxin. J Med Chem48:4919-30 (2005) 
 
Lysophosphatidic acid receptor 3
Name:Lysophosphatidic acid receptor 3
Type:Enzyme
Mol. Mass.:40149.72
Organism:Homo sapiens (Human)
Description:Q9UBY5
Residue:353
BDBM50170846
NameBDBM50170846
Synonyms:CHEMBL190999 | Tetradecyl-phosphonic acid
TypeSmall organic molecule
Emp. Form.C14H31O3P
Mol. Mass.278.3679
(O)(O)=O