Reaction Details
TargetLysophosphatidic acid receptor 3
LigandBDBM50170857
Substrate/Competitorn/a
Meas. Tech.ChEMBL_303206 (CHEMBL829832)
Ki 49±n/a nM
Citation Durgam, GGVirag, TWalker, MDTsukahara, RYasuda, SLiliom, Kvan Meeteren, LAMoolenaar, WHWilke, NSiess, WTigyi, GMiller, DD Synthesis, structure-activity relationships, and biological evaluation of fatty alcohol phosphates as lysophosphatidic acid receptor ligands, activators of PPARgamma, and inhibitors of autotaxin. J Med Chem48:4919-30 (2005) 
 
Lysophosphatidic acid receptor 3
Name:Lysophosphatidic acid receptor 3
Type:Enzyme
Mol. Mass.:40149.72
Organism:Homo sapiens (Human)
Description:Q9UBY5
Residue:353
BDBM50170857
NameBDBM50170857
Synonyms:CHEMBL187795 | Thiophosphoric acid decyl ester
TypeSmall organic molecule
Emp. Form.C10H23O3PS
Mol. Mass.254.327
SMILESCCCCCCCCCCOP(O)(O)=S