Reaction Details
TargetLysophosphatidic acid receptor 1
LigandBDBM50170859
Substrate/Competitorn/a
Meas. Tech.ChEMBL_303205 (CHEMBL829831)
Ki 425±n/a nM
Citation Durgam, GGVirag, TWalker, MDTsukahara, RYasuda, SLiliom, Kvan Meeteren, LAMoolenaar, WHWilke, NSiess, WTigyi, GMiller, DD Synthesis, structure-activity relationships, and biological evaluation of fatty alcohol phosphates as lysophosphatidic acid receptor ligands, activators of PPARgamma, and inhibitors of autotaxin. J Med Chem48:4919-30 (2005) 
 
Lysophosphatidic acid receptor 1
Name:Lysophosphatidic acid receptor 1
Type:Enzyme
Mol. Mass.:41120.55
Organism:Homo sapiens (Human)
Description:Q92633
Residue:364
BDBM50170859
NameBDBM50170859
Synonyms:3-(4-(4-((1-(2-chlorophenyl)ethoxy)carbonyl)-3-methylisoxazol-5-yl)benzylthio)propanoic acid 3-(4-{4-[1-(2-Chloro-phenyl)-ethoxycarbonylamino]-3-methyl-isoxazol-5-yl}-benzylsulfanyl)-propionic acid | CHEMBL361501
TypeSmall organic molecule
Emp. Form.C23H23ClN2O5S
Mol. Mass.474.957
SMILESCC(OC(=O)Nc1c(C)noc1-c1ccc(CSCCC(O)=O)cc1)c1ccccc1Cl