Reaction Details
TargetLysophosphatidic acid receptor 1
LigandBDBM50170863
Substrate/Competitorn/a
Meas. Tech.ChEMBL_312535 (CHEMBL832578)
IC50>10000±n/a nM
Citation Durgam, GGVirag, TWalker, MDTsukahara, RYasuda, SLiliom, Kvan Meeteren, LAMoolenaar, WHWilke, NSiess, WTigyi, GMiller, DD Synthesis, structure-activity relationships, and biological evaluation of fatty alcohol phosphates as lysophosphatidic acid receptor ligands, activators of PPARgamma, and inhibitors of autotaxin. J Med Chem48:4919-30 (2005) 
 
Lysophosphatidic acid receptor 1
Name:Lysophosphatidic acid receptor 1
Type:Enzyme
Mol. Mass.:41120.55
Organism:Homo sapiens (Human)
Description:Q92633
Residue:364
BDBM50170863
NameBDBM50170863
Synonyms:CHEMBL363776 | Phosphoric acid monodec-9-enyl ester
TypeSmall organic molecule
Emp. Form.C10H21O4P
Mol. Mass.236.2451
SMILESOP(O)(=O)OCCCCCCCCC=C