Reaction Details
TargetLysophosphatidic acid receptor 3
LigandBDBM50170861
Substrate/Competitorn/a
Meas. Tech.ChEMBL_303206 (CHEMBL829832)
Ki 575±n/a nM
Citation Durgam, GGVirag, TWalker, MDTsukahara, RYasuda, SLiliom, Kvan Meeteren, LAMoolenaar, WHWilke, NSiess, WTigyi, GMiller, DD Synthesis, structure-activity relationships, and biological evaluation of fatty alcohol phosphates as lysophosphatidic acid receptor ligands, activators of PPARgamma, and inhibitors of autotaxin. J Med Chem48:4919-30 (2005) 
 
Lysophosphatidic acid receptor 3
Name:Lysophosphatidic acid receptor 3
Type:Enzyme
Mol. Mass.:40149.72
Organism:Homo sapiens (Human)
Description:Q9UBY5
Residue:353
BDBM50170861
NameBDBM50170861
Synonyms:(1,1-Difluoro-pentadecyl)-phosphonic acid | CHEMBL188859
TypeSmall organic molecule
Emp. Form.C15H31F2O3P
Mol. Mass.328.3754
(F)(F)P(O)(O)=O