Reaction Details
TargetMetabotropic glutamate receptor 5
LigandBDBM50171052
Substrate/Competitorn/a
Meas. Tech.ChEMBL_322430 (CHEMBL873552)
IC50 36±n/a nM
Citation Kamenecka, TMBonnefous, CGovek, SVernier, JMHutchinson, JChung, JReyes-Manalo, GAnderson, JJ Dipyridyl amines: potent metabotropic glutamate subtype 5 receptor antagonists. Bioorg Med Chem Lett15:4350-3 (2005) 
 
Metabotropic glutamate receptor 5
Name:Metabotropic glutamate receptor 5
Type:Enzyme
Mol. Mass.:132484.72
Organism:Homo sapiens (Human)
Description:n/a
Residue:1212
BDBM50171052
NameBDBM50171052
Synonyms:(3-Ethoxy-5-pyrimidin-5-yl-pyridin-2-yl)-(6-methyl-pyridin-2-yl)-amine | CHEMBL194508
TypeSmall organic molecule
Emp. Form.C17H17N5O
Mol. Mass.307.3498
SMILESCCOc1cc(cnc1Nc1cccc(C)n1)-c1cncnc1