Reaction Details
TargetMetabotropic glutamate receptor 5
LigandBDBM50171071
Substrate/Competitorn/a
Meas. Tech.ChEMBL_322430 (CHEMBL873552)
IC50 119±n/a nM
Citation Kamenecka, TMBonnefous, CGovek, SVernier, JMHutchinson, JChung, JReyes-Manalo, GAnderson, JJ Dipyridyl amines: potent metabotropic glutamate subtype 5 receptor antagonists. Bioorg Med Chem Lett15:4350-3 (2005) 
 
Metabotropic glutamate receptor 5
Name:Metabotropic glutamate receptor 5
Type:Enzyme
Mol. Mass.:132484.72
Organism:Homo sapiens (Human)
Description:n/a
Residue:1212
BDBM50171071
NameBDBM50171071
Synonyms:(3-Ethoxy-5-methyl-pyridin-2-yl)-(6-methyl-pyridin-2-yl)-amine | CHEMBL198209
TypeSmall organic molecule
Emp. Form.C14H17N3O
Mol. Mass.243.3043
SMILESCCOc1cc(C)cnc1Nc1cccc(C)n1